{"text_format":"1","workbook":"xlsx","n_sheets":4,"sheets":["Instructions","Summary","Data","Graph"],"not_rendered":{"charts":2,"images":1,"macros":1,"external_links":0,"defined_names":7,"comments":0,"pivot_tables":1},"unopened":[],"bounds":{"document_bytes":16777216,"sheet_cells":100000,"rows_first":2000,"rows_last":500,"rows_between":2000,"halvings":0,"cell_chars":16384,"cell_head_chars":4096},"cells_cut":0,"cells_raw":0,"read":"whole","date_system":"1900"}

{"sheet":"Instructions","index":0,"n_rows":41,"n_cols":11,"rows_kept":41,"cut":false,"hidden":false,"merged":[[5,2,5,8],[5,10,5,13],[0,0,0,8],[1,0,1,8],[2,0,2,8],[4,2,4,8],[4,10,4,13],[32,0,37,0],[6,2,6,8],[6,10,7,13],[7,3,7,8],[8,10,8,13],[9,0,14,0],[10,10,10,13],[15,0,17,0],[18,0,19,0],[20,0,22,0],[23,0,27,0],[28,0,31,0]]}
["RP²: Benchmarks of Quality "]
["For Home-Visiting Programs [1]"]
["Carol Trivette and Allison Jones"]
[]
["Program Name:",null,null,null,null,null,null,null,null,null,"Type in Program Name"]
["Location:",null,null,null,null,null,null,null,null,null,"Type in Location"]
["Team Members:",null,null,null,null,null,null,null,null,null,"Type in the names of the team members completing the benchmarks"]
[null,null,null,"Not In Place = 0, Partially In Place = 1, In Place = 2"]
["Critical Elements","Indicator #","Benchmark of Quality","Date 1","Date 2","Date 3","Date 4","Date 5","Date 6",null,"Type in the date completed"]
["Establish Leadership Team",1,"Team has broad representation that includes at a minimum an administrator, a home visitor, parent and a member who will serve as an internal coach. Other team members might include related service specialists and other program personnel.  "]
[null,2,"Team has administrative support.  Administrator attends meetings and trainings, is active in problem-solving to ensure the success of increasing child engagement, provides clerical support as needed, and is visibly supportive of the implementation of  DEC Recommended Practices (RP) to promote child engagement. Administrator ensures budgeting and professional development opportunities are available to result in high fidelity implementation of RP program-wide.",null,null,null,null,null,null,null,"Type in your scores:\nNot in place = 0\nPartially in place = 1\nIn place = 2"]
[null,3,"Team has regular meetings. Team meetings are scheduled at least 1x per month for a minimum of 1 hour.  Team member attendance is consistent.  Team establishes meeting ground rules and other logistics for effective team meetings."]
[null,4,"Team has established a clear mission/purpose related to high fidelity implementation. The team purpose or mission statement is written. Team members are able to clearly communicate the purpose of the Leadership Team.  "]
[null,5,"Team develops implementation goals for each of the critical elements. A written action plan guides the work of the team. The team reviews the plan and updates their progress at each meeting. Action steps are identified to ensure achievement of implementation and sustainability goals. "]
[null,6,"Team reviews and revises the action plan for implementing Recommended Practices and increasing child engagement at least annually. "]
["Staff Readiness and Buy-In",7,"Staff members are aware of the need for program-wide implementation of Recommended Practices. The Leadership Team provides staff with information on the importance of increased child engagement.  Through a short staff meeting, all staff understands the long term goals, personal responsibilities of program-wide implementation of DEC RP and the potential increase in outcomes for all children and families."]
[null,8,"Staff members are supportive of program-wide implementation of Recommended Practices. A process is used to establish that program staff have buy-in and agree with a focus on program-wide implementation.   "]
[null,9,"Staff input and feedback is obtained throughout the implementation process. The Leadership Team provides updates on the process, data, and the outcomes of the implementation to program staff on a regular basis."]
["Family Engagement",10,"Family input is solicited as part of the planning process.  Families are informed of the program-wide goals for increasing child engagement and asked to provide feedback on adoption and mechanisms for promoting family involvement in the implementation. "]
[null,11,"There are multiple mechanisms for sharing the program’s implementation goals with families including narrative documents, parent handbook, and individual discussions to ensure that families are informed of the implementation."]
["Program-Wide Action Plan",12,"Program-wide Action Plan is developed by the Leadership Team to guide implementation process.  Data are used to guide the development of the Action Plan."]
[null,13,"Specific action steps are identified to ensure achievement and sustainability of the implementation goals."]
[null,14,"All program staff members are aware of and regularly review the implementation goals. "]
["All Home Visitors Demonstrate Implementation of Recommended Practices with Families and Children",15,"The Leaderships Team’s effort to improve the implementation of Recommended Practices is visible throughout the program within program materials and practice guidance. "]
[null,16,"Home visitors help families identify or arrange environments and materials in a manner that promotes and guides increased engagement of their children in everyday activities and routines."]
[null,17,"Home visitors help families identify appropriate interactional and instructional strategies that can be embedded in interest-based everyday routines and activities in a manner that is meaningful to their children and promotes engagement."]
[null,18,"Home visitors use strategies derived from Recommended Practices to develop a positive and supportive relationship with families and caregivers through everyday participation in everyday routines and activities that are interesting to the child."]
[null,19,"Home visitors use strategies derived from Recommended Practices to enhance the confidence and competence of families to support their children’s learning in everyday routines and activities."]
["Building Staff Capacity",20,"A plan for providing ongoing coaching on the implementation of Recommended Practices with fidelity is developed and implemented."]
[null,21,"The staff responsible (i.e., internal coach) for facilitating coaching and support processes (e.g., community of practice) are identified and trained."]
[null,22,"The coach uses needs assessment data, implementation fidelity checklists, home visit observations, and interviews to collaboratively identify implementation goals with home visiting staff."]
[null,23,"A process for training new staff members is developed and has been implemented. "]
["Monitoring Implementation and Outcomes",24,"The program Leadership Team monitors implementation fidelity of the use of the components of program-wide implementation and uses data for decision-making about their implementation plan."]
[null,25,"The program measures implementation fidelity (practice checklists) of the use of Recommended Practices by home visitors and uses data on implementation fidelity to make decisions about professional development and coaching support."]
[null,26,"The program monitors the family’s use of the intervention plan developed with the home visitor that promotes child learning.  "]
[null,27,"The program monitors the level of child engagement in learning activities and uses the child engagement data to make decisions about intervention and instructional support."]
[null,28,"Data are collected, summarized with visual displays, and reviewed by the Leadership Team on a regular basis.  "]
[null,29,"Program level data are summarized and shared with program staff and families."]
[]
[]
{"$rows_left_out":2}
{"sheet":"Summary","index":1,"n_rows":83,"n_cols":12,"rows_kept":83,"cut":false,"hidden":false,"merged":[[35,6,35,11],[37,9,37,11],[38,9,38,11],[39,9,39,11],[41,9,41,11],[24,2,24,4],[34,2,34,4],[25,6,25,11],[27,9,27,11],[28,9,28,11],[29,9,29,11],[31,9,31,11],[44,2,44,4],[45,6,45,11],[47,9,47,11],[48,9,48,11],[49,9,49,11],[51,9,51,11],[54,2,54,4],[55,6,55,11],[57,9,57,11],[58,9,58,11],[79,9,79,11],[81,9,81,11],[59,9,59,11],[61,9,61,11],[64,2,64,4],[65,6,65,11],[67,9,67,11],[74,2,74,4],[75,6,75,11],[77,9,77,11],[78,9,78,11],[68,9,68,11],[69,9,69,11],[71,9,71,11]]}
[]
[]
[]
[]
[]
[]
[]
[]
[]
[]
[]
[]
[]
[]
[]
[]
[]
[]
[]
[null,null,{"$f":"Data!D9","v":"Date 1"},{"$f":"Data!E9","v":"Date 2 "},{"$f":"Data!F9","v":"Date 3"},{"$f":"Data!G9","v":"Date 4"},{"$f":"Data!H9","v":"Date 5"},{"$f":"Data!I9","v":"Date 6"}]
[null,"Percent of Indicators Not in Place",{"$f":"IF(ISERROR(Graph!I40/32),\"\",Graph!I40/32)","v":0},{"$f":"IF(ISERROR(Graph!I41/32),\"\",Graph!I41/32)","v":0},{"$f":"IF(ISERROR(Graph!I42/32),\"\",Graph!I42/32)","v":0},{"$f":"IF(ISERROR(Graph!I43/32),\"\",Graph!I43/32)","v":0},{"$f":"IF(ISERROR(Graph!I44/32),\"\",Graph!I44/32)","v":0},{"$f":"IF(ISERROR(Graph!I45/32),\"\",Graph!I45/32)","v":0}]
[null,"Percent of Indicators Partially in Place",{"$f":"IF(ISERROR(Graph!J40/32),\"\",Graph!J40/32)","v":0},{"$f":"IF(ISERROR(Graph!J41/32),\"\",Graph!J41/32)","v":0},{"$f":"IF(ISERROR(Graph!J42/32),\"\",Graph!J42/32)","v":0},{"$f":"IF(ISERROR(Graph!J43/32),\"\",Graph!J43/32)","v":0},{"$f":"IF(ISERROR(Graph!J44/32),\"\",Graph!J44/32)","v":0},{"$f":"IF(ISERROR(Graph!J45/32),\"\",Graph!J45/32)","v":0}]
[null,"Percent of Indicators In Place",{"$f":"IF(ISERROR(Graph!K40/32),\"\",Graph!K40/32)","v":0},{"$f":"IF(ISERROR(Graph!K41/32),\"\",Graph!K41/32)","v":0},{"$f":"IF(ISERROR(Graph!K42/32),\"\",Graph!K42/32)","v":0},{"$f":"IF(ISERROR(Graph!K43/32),\"\",Graph!K43/32)","v":0},{"$f":"IF(ISERROR(Graph!K44/32),\"\",Graph!K44/32)","v":0},{"$f":"IF(ISERROR(Graph!K45/32),\"\",Graph!K45/32)","v":0}]
[]
[null,null,"# of Indicators"]
[null,null,"Not in Place","Partially in Place","In Place",null,"Benchmarks Not In Place:"]
[null,"Establish Leadership Team",{"$f":"COUNTIF(Data!D10:D15,0)","v":0},{"$f":"COUNTIF(Data!D10:D15,1)","v":0},{"$f":"COUNTIF(Data!D10:D15,2)","v":0},null,{"$f":"IF(Data!D10=0,Data!B10,\"\")","v":1},{"$f":"IF(Data!D11=0,Data!B11,\"\")","v":2},{"$f":"IF(Data!D12=0,Data!B12,\"\")","v":3},{"$f":"IF(Data!D13=0,Data!B13,\"\")","v":4},{"$f":"IF(Data!D14=0,Data!B14,\"\")","v":5},{"$f":"IF(Data!D15=0,Data!B15,\"\")","v":6}]
[null,"Staff Readiness and Buy-In",{"$f":"COUNTIF(Data!D16:D18,0)","v":0},{"$f":"COUNTIF(Data!D16:D18,1)","v":0},{"$f":"COUNTIF(Data!D16:D18,2)","v":0},null,{"$f":"IF(Data!D16=0,Data!B16,\"\")","v":7},{"$f":"IF(Data!D17=0,Data!B17,\"\")","v":8},{"$f":"IF(Data!D18=0,Data!B18,\"\")","v":9}]
[null,"Family Engagement",{"$f":"COUNTIF(Data!D19:D21,0)","v":0},{"$f":"COUNTIF(Data!D19:D21,1)","v":0},{"$f":"COUNTIF(Data!D19:D21,2)","v":0},null,{"$f":"IF(Data!D19=0,Data!B19,\"\")","v":10},{"$f":"IF(Data!D20=0,Data!B20,\"\")","v":11},{"$f":"IF(Data!D21=0,Data!B21,\"\")","v":12}]
[null,"Program-Wide Action Plan",{"$f":"COUNTIF(Data!D22:D24,0)","v":0},{"$f":"COUNTIF(Data!D22:D24,1)","v":0},{"$f":"COUNTIF(Data!D22:D24,2)","v":0},null,{"$f":"IF(Data!D22=0,Data!B22,\"\")","v":13},{"$f":"IF(Data!D23=0,Data!B23,\"\")","v":14},{"$f":"IF(Data!D24=0,Data!B24,\"\")","v":15}]
[null,"All Home Visitors Demonstrate Implementation of Recommended Practices with Families and Children",{"$f":"COUNTIF(Data!D25:D29,0)","v":0},{"$f":"COUNTIF(Data!D25:D29,1)","v":0},{"$f":"COUNTIF(Data!D25:D29,2)","v":0},null,{"$f":"IF(Data!D25=0,Data!B25,\"\")","v":16},{"$f":"IF(Data!D26=0,Data!B26,\"\")","v":17},{"$f":"IF(Data!D27=0,Data!B27,\"\")","v":18},{"$f":"IF(Data!D28=0,Data!B28,\"\")","v":19},{"$f":"IF(Data!D29=0,Data!B29,\"\")","v":20}]
[null,"Building Staff Capacity",{"$f":"COUNTIF(Data!D30:D32,0)","v":0},{"$f":"COUNTIF(Data!D30:D32,1)","v":0},{"$f":"COUNTIF(Data!D30:D32,2)","v":0},null,{"$f":"IF(Data!D30=0,Data!B30,\"\")","v":21},{"$f":"IF(Data!D31=0,Data!B31,\"\")","v":22},{"$f":"IF(Data!D32=0,Data!B32,\"\")","v":23}]
[null,"Monitoring Implementation and Outcomes",{"$f":"COUNTIF(Data!D33:D38,0)","v":0},{"$f":"COUNTIF(Data!D33:D38,1)","v":0},{"$f":"COUNTIF(Data!D33:D382,2)","v":0},null,{"$f":"IF(Data!D33=0,Data!B33,\"\")","v":24},{"$f":"IF(Data!D34=0,Data!B34,\"\")","v":25},{"$f":"IF(Data!D35=0,Data!B35,\"\")","v":26},{"$f":"IF(Data!D36=0,Data!B36,\"\")","v":27},{"$f":"IF(Data!D37=0,Data!B37,\"\")","v":28},{"$f":"IF(Data!D38=0,Data!B38,\"\")","v":29}]
[]
[null,null,"# of Indicators"]
[null,null,"Not in Place","Partially in Place","In Place",null,"Benchmarks Not In Place:"]
[null,"Establish Leadership Team",{"$f":"COUNTIF(Data!E10:E15,0)","v":0},{"$f":"COUNTIF(Data!E10:E15,1)","v":0},{"$f":"COUNTIF(Data!E10:E15,2)","v":0},null,{"$f":"IF(Data!E10=0,Data!B10,\"\")","v":1},{"$f":"IF(Data!E11=0,Data!B11,\"\")","v":2},{"$f":"IF(Data!E12=0,Data!B12,\"\")","v":3},{"$f":"IF(Data!E13=0,Data!B13,\"\")","v":4},{"$f":"IF(Data!E14=0,Data!B14,\"\")","v":5},{"$f":"IF(Data!E15=0,Data!B15,\"\")","v":6}]
[null,"Staff Readiness and Buy-In",{"$f":"COUNTIF(Data!E16:E18,0)","v":0},{"$f":"COUNTIF(Data!E16:E18,1)","v":0},{"$f":"COUNTIF(Data!E16:E18,2)","v":0},null,{"$f":"IF(Data!E16=0,Data!B16,\"\")","v":7},{"$f":"IF(Data!E17=0,Data!B17,\"\")","v":8},{"$f":"IF(Data!E18=0,Data!B18,\"\")","v":9}]
[null,"Family Engagement",{"$f":"COUNTIF(Data!E19:E21,0)","v":0},{"$f":"COUNTIF(Data!E19:E21,1)","v":0},{"$f":"COUNTIF(Data!E19:E21,2)","v":0},null,{"$f":"IF(Data!E19=0,Data!B19,\"\")","v":10},{"$f":"IF(Data!E20=0,Data!B20,\"\")","v":11},{"$f":"IF(Data!E21=0,Data!B21,\"\")","v":12}]
[null,"Program-Wide Action Plan",{"$f":"COUNTIF(Data!E22:E24,0)","v":0},{"$f":"COUNTIF(Data!E22:E24,1)","v":0},{"$f":"COUNTIF(Data!E22:E24,2)","v":0},null,{"$f":"IF(Data!E22=0,Data!B22,\"\")","v":13},{"$f":"IF(Data!E23=0,Data!B23,\"\")","v":14},{"$f":"IF(Data!E24=0,Data!B24,\"\")","v":15}]
{"$rows_left_out":44}
{"sheet":"Data","index":2,"n_rows":41,"n_cols":9,"rows_kept":41,"cut":false,"hidden":false,"merged":[[6,2,6,8],[0,0,0,8],[1,0,1,8],[2,0,2,8],[4,2,4,8],[5,2,5,8],[23,0,27,0],[28,0,31,0],[32,0,37,0],[7,3,7,8],[15,0,17,0],[9,0,14,0],[18,0,19,0],[20,0,22,0]]}
["RP²: Benchmarks of Quality "]
["For Home-Visiting Programs [1]"]
["Carol Trivette and Allison Jones"]
[]
["Program Name:"]
["Location:"]
["Team Members:"]
[null,null,null,"Not In Place = 0, Partially In Place = 1, In Place = 2"]
["Critical Elements","Indicator #","Benchmark of Quality","Date 1","Date 2 ","Date 3","Date 4","Date 5","Date 6"]
["Establish Leadership Team",1,"Team has broad representation that includes at a minimum an administrator, a home visitor, parent and a member who will serve as an internal coach. Other team members might include related service specialists and other program personnel.  "]
[null,2,"Team has administrative support.  Administrator attends meetings and trainings, is active in problem-solving to ensure the success of increasing child engagement, provides clerical support as needed, and is visibly supportive of the implementation of  DEC Recommended Practices (RP) to promote child engagement. Administrator ensures budgeting and professional development opportunities are available to result in high fidelity implementation of RP program-wide."]
[null,3,"Team has regular meetings. Team meetings are scheduled at least 1x per month for a minimum of 1 hour.  Team member attendance is consistent.  Team establishes meeting ground rules and other logistics for effective team meetings."]
[null,4,"Team has established a clear mission/purpose related to high fidelity implementation. The team purpose or mission statement is written. Team members are able to clearly communicate the purpose of the Leadership Team.  "]
[null,5,"Team develops implementation goals for each of the critical elements. A written action plan guides the work of the team. The team reviews the plan and updates their progress at each meeting. Action steps are identified to ensure achievement of implementation and sustainability goals. "]
[null,6,"Team reviews and revises the action plan for implementing Recommended Practices and increasing child engagement at least annually. "]
["Staff Readiness and Buy-In",7,"Staff members are aware of the need for program-wide implementation of Recommended Practices. The Leadership Team provides staff with information on the importance of increased child engagement.  Through a short staff meeting, all staff understands the long term goals, personal responsibilities of program-wide implementation of DEC RP and the potential increase in outcomes for all children and families."]
[null,8,"Staff members are supportive of program-wide implementation of Recommended Practices. A process is used to establish that program staff have buy-in and agree with a focus on program-wide implementation.   "]
[null,9,"Staff input and feedback is obtained throughout the implementation process. The Leadership Team provides updates on the process, data, and the outcomes of the implementation to program staff on a regular basis."]
["Family Engagement",10,"Family input is solicited as part of the planning process.  Families are informed of the program-wide goals for increasing child engagement and asked to provide feedback on adoption and mechanisms for promoting family involvement in the implementation. "]
[null,11,"There are multiple mechanisms for sharing the program’s implementation goals with families including narrative documents, parent handbook, and individual discussions to ensure that families are informed of the implementation."]
["Program-Wide Action Plan",12,"Program-wide Action Plan is developed by the Leadership Team to guide implementation process.  Data are used to guide the development of the Action Plan."]
[null,13,"Specific action steps are identified to ensure achievement and sustainability of the implementation goals."]
[null,14,"All program staff members are aware of and regularly review the implementation goals. "]
["All Home Visitors Demonstrate Implementation of Recommended Practices with Families and Children",15,"The Leaderships Team’s effort to improve the implementation of Recommended Practices is visible throughout the program within program materials and practice guidance. "]
[null,16,"Home visitors help families identify or arrange environments and materials in a manner that promotes and guides increased engagement of their children in everyday activities and routines."]
[null,17,"Home visitors help families identify appropriate interactional and instructional strategies that can be embedded in interest-based everyday routines and activities in a manner that is meaningful to their children and promotes engagement."]
[null,18,"Home visitors use strategies derived from Recommended Practices to develop a positive and supportive relationship with families and caregivers through everyday participation in everyday routines and activities that are interesting to the child."]
[null,19,"Home visitors use strategies derived from Recommended Practices to enhance the confidence and competence of families to support their children’s learning in everyday routines and activities."]
["Building Staff Capacity",20,"A plan for providing ongoing coaching on the implementation of Recommended Practices with fidelity is developed and implemented."]
[null,21,"The staff responsible (i.e., internal coach) for facilitating coaching and support processes (e.g., community of practice) are identified and trained."]
[null,22,"The coach uses needs assessment data, implementation fidelity checklists, home visit observations, and interviews to collaboratively identify implementation goals with home visiting staff."]
[null,23,"A process for training new staff members is developed and has been implemented. "]
["Monitoring Implementation and Outcomes",24,"The program Leadership Team monitors implementation fidelity of the use of the components of program-wide implementation and uses data for decision-making about their implementation plan."]
[null,25,"The program measures implementation fidelity (practice checklists) of the use of Recommended Practices by home visitors and uses data on implementation fidelity to make decisions about professional development and coaching support."]
[null,26,"The program monitors the family’s use of the intervention plan developed with the home visitor that promotes child learning.  "]
[null,27,"The program monitors the level of child engagement in learning activities and uses the child engagement data to make decisions about intervention and instructional support."]
[null,28,"Data are collected, summarized with visual displays, and reviewed by the Leadership Team on a regular basis.  "]
[null,29,"Program level data are summarized and shared with program staff and families."]
[]
[]
{"$rows_left_out":2}
{"sheet":"Graph","index":3,"n_rows":57,"n_cols":11,"rows_kept":57,"cut":false,"hidden":false,"merged":[[1,1,1,6],[2,1,2,6],[3,1,3,6]]}
["Report Date:",{"$f":"NOW()","v":"2018-03-21T12:28:57.400"}]
["Program Name:",{"$f":"Data!C5","v":0}]
["Location:",{"$f":"Data!C6","v":0}]
["Team Members:",{"$f":"Data!C7","v":0}]
[]
[]
[]
[]
[]
[]
[]
[]
[]
[]
[]
[]
[]
[]
[]
[]
[]
[]
[]
[]
[]
[]
[]
[]
[]
[]
[]
[]
[]
[]
[]
[]
[]
[]
["Date","Establish Leadership Team","Staff Readiness and Buy-In","Family Engagement","Program-Wide Action Plan","All Home Visitors Demonstrate Implementation of Recommended Practices with Families and Children","Building Staff Capacity","Monitoring Implementation and Outcomes","Not in Place","Partially in Place","In Place"]
[{"$f":"Data!D9","v":"Date 1"},{"$f":"IF(ISERROR(AVERAGE(Data!D10:D15)),\"\",(AVERAGE(Data!D10:D15)))","v":""},{"$f":"IF(ISERROR(AVERAGE(Data!D16:D18)),\"\",(AVERAGE(Data!D16:D18)))","v":""},{"$f":"IF(ISERROR(AVERAGE(Data!D19:D20)),\"\",(AVERAGE(Data!D19:D20)))","v":""},{"$f":"IF(ISERROR(AVERAGE(Data!D21:D23)),\"\",(AVERAGE(Data!D21:D23)))","v":""},{"$f":"IF(ISERROR(AVERAGE(Data!D24:D28)),\"\",(AVERAGE(Data!D24:D28)))","v":""},{"$f":"IF(ISERROR(AVERAGE(Data!D29:D32)),\"\",(AVERAGE(Data!D29:D32)))","v":""},{"$f":"IF(ISERROR(AVERAGE(Data!D33:D38)),\"\",(AVERAGE(Data!D33:D38)))","v":""},{"$f":"COUNTIF(Data!D10:D38,0)","v":0},{"$f":"COUNTIF(Data!D10:D38,1)","v":0},{"$f":"COUNTIF(Data!D10:D38,2)","v":0}]
{"$rows_left_out":17}